• Fatal Error Minix/config.h

    s500 Frame Naza M Lite İlk Uçuş[SOLVED] libcanberra error – LinuxQuestions.org – … I get an error of Code: Makefile:936: *** missing … checking minix/config.h usability configure:5036: … fatal error: minix/config.h: No such file or directory compilation terminated. configure:5043: $? = 1 configure: failed program was: | /* confdefs.h.

    Octave – General – Help installing octave 3.2.4 from source? – conftest.c:53:26: fatal error: minix/config.h: No such file or directory… g++: Carbon: No such file or directory cc1plus: error: unrecognized command line option “-framework”… conftest.c:66:27: fatal error: qhull/qhull_a.h: No such file or directory…

    OKI News: What does “Fatal Error” mean? – Oki Data Americas, Inc. – Printer has displayed a “Fatal Error” message. This simply means a problem has occurred requiring you to take action. It does NOT mean that your printer has “died”. Your printer display or status monitor may read “Fatal Error”.

    … $? = 1 configure: failed program was: configure:4285: checking minix/config.h usability configure:4285: … fatal error: minix/config.h: No such file or directory compilation terminated. configure:4285: $? = 1 configure: …

    Explore these great resources across Microsoft.com. Windows. All Windows downloads; Download Windows 8.1 … Office. All Office downloads; Download Office; Free trials

    conftest.c:52:26: fatal error: minix/config.h: No such file or directory conftest.c:19:26: fatal error: … ApplicationServices/ApplicationServices.h: No such file or directory conftest.c:70:17: fatal error: dns.h: No such file or directory conftest.c:72:20: fatal error: ieeefp.h: …

    How to fix a fatal exception error. Microsoft Windows and software use exceptions, which allow Windows or other software to communicate in layers and communicate errors or exceptions. If a program is given an exception that is invalid or unknown you’ll encounter a fatal exception.

    ERROR: Build error x11/libX11 [config.log attached] iZEN izen at mail.ru Mon May 21 14:31:11 UTC … checking minix/config.h presence configure:3888: cpp conftest.c conftest.c:19:10: fatal error: ‘minix/config.h’ file not found #include ^ 1 error generated …

    I get the following error while trying to install Ruby 1.9.3 on Trisquel 6 using the following command rvm install 1.9.3 ERROR Error running ‘./configure