• Fatal Error Fitz H

    Steam Stuck in Offline Mode (Steam needs to be online to update, but was set to offline mode)$ /cygdrive/c/Users/MEHDI/Downloads/Compressed/android-ndk … – … fatal error: mupdf/fitz.h: No such file or directory. … Error 1. clone this paste RAW Paste Data Pastebin.com Tools & Applications. iPhone/iPad Windows Firefox Chrome WebOS Android Mac Opera Click.to UNIX WinPhone. create new …

    android: MuPDF Android Library Build – blogspot.com – Android SDK should be installed. 2. … jni/mupdf.c:15:24: fatal error: mupdf/fitz.h: No such file or directory compilation terminated. make: *** [obj/local/armeabi-v7a/objs/mupdf/mupdf.o] Error 1 **** Build Finished **** Please,help me out!!!

    JackNg C. H. Blog: Solved STOP … – There are 3 partitions in the Dell Optiplex 9010 pc [Intel Core i7-3770 (3.40 Ghz) CPU, 32 GB DDR3 1600 Mhz memory, 1 TB SATA hardisk drive, etc]:…

    fatal error C1083: Cannot open include file: ‘iostream.h’: … Hello – 1 error(s), 0 warning(s) ===== Build: 0 succeeded, 1 failed, 0 up-to-date, 0 skipped ===== … fatal error C1083 1.below is command line: C: …

    Possible Duplicate: No such file iostream.h when including Even after naming the source file with .cpp extension. my compiler gives this error, both in ……

    Previous Post Security Update for Microsoft Visual Studio 2010 (KB2455033) failed with Code 643 Next Post Strange file named “剐䍏塅ㅐ〰匮卙” in ……

    Hi I am building prelink and for this I first built elfutils-0.153 package. Now, when i try to configure prelink with command : ./configure CPPFLAGS=&q…

    Integrating PDF in Android application. July 31, 2013 Dixit 19 Comments. Having support for PDFs in-built in your android application is some time very important to user experience, … fatal error: mupdf/fitz.h: No such file or directory

    “Compile arm : apv <= apvcore.c In file included from jni/pdfview2/apvcore.c:6:0: jni/pdfview2/apvcore.h:10:18: fatal error: fitz.h: No such file or directory compilation terminated. make: [obj/local/armeabi-v7a/objs/apv/apvcore.o] Error 1 .

    P95 – FATAL ERROR: Rounding was 0.5, expected less than 0.4 Overclocking & Cooling…

    I m trying to compile the muPDF lib in eclipse for android app since 3 days without any success I downloaded and configured the android-ndk, cygwin Im getting this still 15:25:36 **** Build of

    This are the steps to acces other server with keys At client ssh-keygen -t rsa scp .ssh/id_rsa.pub server: At users home on server mkdi……

    *potential solution for the error described below was to switch my Win7 desktop theme from an Aero theme to a basic theme, I chose classic. I am able to ……

    [gs-bugs] [Bug 695404] New: fatal error: mupdf/fitz.h: No such file or directory compilation terminated. bugzilla-daemon at ghostscript.com bugzilla-daemon at ghostscript.com Fri Aug 1 11:49:48 UTC 2014. Previous message: …