• Error ‘__cap_bits’ Undeclared

    ltib – Problem with building libcap – Nabble – Problem with building libcap. Hey guys, I want to include a new package to LTIB: libcap2. A tarball is made and moved to /opt/freescale/pkgs. The specfile looks like this: >…

    Re: [Ltib] Problem with building libcap – Now the error with __CAP_BITS disappeared, but another error cames up: # $ ./ltib -m scbuild -p libcap.spec # # Processing: libcap # ===== # Build path taken because: build key set, no prebuilt rpm, # …

    [beagleboard] Re: FTP server on beagleboard – Frans … – I just tried to bitbake proftpd, and it failed: ERROR: function do_compile failed ERROR: see log in /OE/angstrom-dev/work/armv7a-angstrom-linux-gnueabi … In function ‘cap_get_flag’: cap_flag.c:28: error: ‘__CAP_BITS’ undeclared (first use in this function) cap_flag.c:28: error: (Each …

    c++ – error C2065: ‘nowhere’ : undeclared identifier – Stack … – So, I’m trying to make a text based game in C++ Using Visual Studio 2010. Here are some of the code blocks that I think are related. If you need anymore, don’t hesitate to ask me. I’m trying to cr…

    C++ – error C2065: end1 : undeclared identifier – posted in General Programming: I am new to C++ and I am teaching it to myself with some tutorials and Visual C++ Express. Ive gotten this so far through a tutorial but I cant figure out where I went wrong… The error I get is error C2065: end1 …

    error C2065: ‘endl’ : undeclared identifier-error C2065: ‘end … and Interop http://social.msdn.microsoft.com/Forums/vstudio/en-US/b3c484ca-ac09-48fc-9455-de1b42e7bb6d/error-c2065-endl-undeclared-identifiererror-c2065-end-undeclared-identifier?forum=vclanguage Question 9 3/18/2007 5:05:46 AM …

    Compiler Error C2065. Visual Studio 2013 Other Versions Visual Studio 2012; Visual Studio … Visual Studio 2005; Visual Studio .NET 2003 ‘identifier’ : undeclared identifier. A variable’s type must be specified in a declaration before it can be used. The parameters that a function uses must …

    ERROR: see log in /OE/angstrom-dev/work/armv7a-angstrom-linux-gnueabi/proftpd-1.3.2-r2/temp/log.do_compile.2581 This is the content of the log-file: … cap_flag.c:58: error: ‘__CAP_BITS’ undeclared (first use in this function) make[1]: *** [cap_flag.o] Error 1

    Describes an issue where the _com_issue_error and _com_issue_errorex functions are not recognized when you use the #import directive in eMbedded Visual C++ in Windows CE.