• Clang Error Unknown Argument ‘-multiply_definedsuppress’

    gem fails install, clang: error: unknown argument: ‘-multiply … – … ^~~ 2 warnings generated. linking shared-object RMagick2.bundle clang: error: unknown argument: ‘-multiply_definedsuppress’ make: *** [RMagick2.bundle] … But the clang: error: unknown argument: … unknown arguments that previously could slide by, …

    Welcome to the sixtieth issue of LLVM Weekly, a weekly newsletter (published every Monday) covering developments in LLVM, Clang, and related projects….

    clang: error: unknown argument: ‘-multiply_definedsuppress’ [-Wunused-command-line-argument-hard-error-in-future] clang: note: this will be a hard error (cannot be downgraded to a warning) in the future make: *** [ext.bundle] Error 1.

    “I would like to take this opportunity to thank Ratchet for being such a great role model, and a pillar of our community! If anyone can save us, it’s you ……

    When this is disabled, Clang will print “test.c:28: warning…” with no column number. The printed column numbers count bytes from the beginning of the ……

    By Sylvestre Ledru (Debian, IRILL). February 28th 2012 (clang 3.0), June 23th 2012 (clang 3.1), January 28th 2013 (clang 3.2), July 14th 2013 (clang 3.3 ……

    I was trying run gem install json and got the following error Gem::Ext::BuildError: ERROR: Failed to build gem native extension. /System/Library/Frameworks/Ruby.framework/Versions/2./usr/bin… current community. chat blog. Stack Overflow

    Clang Error Unknown Argument ‘-multiply_definedsuppress … Android NDK | Android Developers – Important changes: Added support for the Clang 3.4 compiler. … Previous Post 453 Error Invalid Number At&t Next Post Arcsoft Showbiz Error.

    Text below is selected. Please press Ctrl+C to copy to your clipboard. (⌘+C on Mac)

    In addition to parsing and generating machine code for your source files when valid, a compiler frontend’s job is also to detect invalid code and give you ……

    … ‘DESTDIR=’ clean make ‘DESTDIR=’ compiling generator.c linking shared-object json/ext/generator.bundle clang: error: unknown argument: ‘-multiply_definedsuppress’ … clang: note: this will be a hard error (cannot be downgraded to a warning) in the future make: *** …

    Clang 3.5.0 has just been released. A new rebuild has been done highlight the progress to get Debian built with clang. tl;dr: Great progress. We decreased ……

    For now, it is sensible to version this document by the releases of its sole implementation (and its host project), clang. “LLVM X.Y” refers to an open ……

    I get the following error when attempting to install psycopg2 via pip on Mavericks 10.9: clang: error: unknown argument: ‘-mno-fused-madd’ [-Wunused-command-line-argument-hard-error-in-future] Not . current community. chat blog. Stack Overflow

    Note: I originally wrote the blog post while installing mitmproxy on OS X Mavericks, but it is relevant to the “unknown argument” error in general, so ……